Other Sound Recording Industries
type: Class
subclass of: 4S1iUzATQG-tZjcPCHRpNg
definition: This industry comprises establishments primarily engaged in providing sound recording services (except record production, distribution, music publishing, and sound recording in a studio). Establishments in this industry provide services, such as the audio recording of meetings and conferences.