Phosphatic Fertilizer Manufacturing
type: Class
subclass of: 3ZTyLmpASpO3CDM8aVnHNw
definition: This U.S. industry comprises establishments primarily engaged in (1) manufacturing phosphatic fertilizer materials or (2) manufacturing phosphatic materials and mixing with other ingredients into fertilizers.