Household Appliance Manufacturing
type: Class
subclass of: R83VhHEeaRnvGWxfksxJUSc
definition: This industry group comprises establishments primarily engaged in manufacturing small electric appliances, electric housewares, and major household appliances.