Interurban and Rural Bus Transportation
type: Class
subclass of: plc1hyjOSXqMLEuBZc7epg
definition: This industry comprises establishments primarily engaged in providing bus passenger transportation over regular routes and on regular schedules, principally outside a single metropolitan area and its adjacent nonurban areas.