Carpet and Rug Mills
type: Class
subclass of: iSGv6BT Tm-SHEN-3kx-EQ
definition: This industry comprises establishments primarily engaged in (1) manufacturing woven, tufted, and other carpets and rugs, such as art squares, floor mattings, needlepunch carpeting, and door mats and mattings, from textile materials or from twisted paper, grasses, reeds, sisal, jute, or rags and/or (2) finishing carpets and rugs.