Meat and Meat Product Merchant Wholesalers
type: Class
subclass of: nxYZd fHQLWQNa9h0mIU A
definition: This industry comprises establishments primarily engaged in the merchant wholesale distribution of meats and meat products (except canned and packaged frozen) and/or lard.