Plastics Packaging Materials and Unlaminated Film and Sheet Manufacturing
type: Class
subclass of: P2ahRVjlQwyn4knwwoIQvw
definition: This industry comprises establishments primarily engaged in (1) converting plastics resins into unsupported plastics film and sheet and/or (2) forming, coating, or laminating plastics film and sheet into plastics bags.