Industrial Process Furnace and Oven Manufacturing
type: Class
subclass of: z92pj9hTTd2-Vgl3rH8XfQ
definition: This U.S. industry comprises establishments primarily engaged in manufacturing industrial process ovens, induction and dielectric heating equipment, and kilns (except cement, chemical, wood). Included in this industry are establishments manufacturing laboratory furnaces and ovens.