Teleproduction and Other Postproduction Services
type: Class
subclass of: 8b95fl5bRqyso7R8Abf2Mg
definition: This U.S. industry comprises establishments primarily engaged in providing specialized motion picture or video postproduction services, such as editing, film/tape transfers, subtitling, credits, closed captioning, and animation and special effects.