Sugar and Confectionery Product Manufacturing
type: Class
subclass of: RCaeZbTg74NX3xyNzskpVH8
definition: This industry group comprises (1) establishments that process agricultural inputs, such as sugarcane, beet, and cacao, to give rise to a new product (sugar or chocolate) and (2) establishments that begin with sugar and chocolate and process these further.