Industrial Valve Manufacturing
type: Class
subclass of: J5TrhNp2TP-pHSl3EP7OwA
definition: This U.S. industry comprises establishments primarily engaged in manufacturing industrial valves and valves for water works and municipal water systems.
example: Complete fire hydrants manufacturing
example: Industrial-type ball valves manufacturing
example: Industrial-type butterfly valves manufacturing
example: Industrial-type check valves manufacturing
example: Industrial-type gate valves manufacturing
example: Industrial-type globe valves manufacturing
example: Industrial-type plug valves manufacturing
example: Industrial-type solenoid valves (except fluid power) manufacturing
example: Industrial-type steam traps manufacturing
example: Valves for nuclear applications manufacturing