All Other Fabricated Metal Product Manufacturing
type: Class
subclass of: DbtxgpjETQe4-NpFNxv5dQ
definition: This industry comprises establishments primarily engaged in manufacturing fabricated metal products (except forgings and stampings, cutlery and handtools, architectural and structural metal products, boilers, tanks, shipping containers, hardware, spring and wire products, machine shop products, turned products, screws, nuts and bolts, and metal valves).
example: Ammunition manufacturing
example: Ball and roller bearing manufacturing
example: Enameled iron and metal sanitary ware manufacturing
example: Fabricated pipe and pipe fittings made from purchased metal pipe
example: Foil containers (except bags) manufacturing
example: Industrial pattern manufacturing
example: Metal safes manufacturing
example: Portable metal ladders manufacturing
example: Small arms and other ordnance manufacturing
example: Steel wool manufacturing