Other Electronic Component Manufacturing
type: Class
subclass of: h3GjRS3mT76GlOkN0SlOrg
definition: Transducers (except pressure) manufacturing
example: Crystals and crystal assemblies, electronic, manufacturing
example: Electron tubes manufacturing
example: LCD (liquid crystal display) unit screens manufacturing
example: Microwave components manufacturing
example: Piezoelectric devices manufacturing
example: Printed circuit laminates manufacturing
example: Switches for electronic applications manufacturing