All Other Legal Services
type: Class
subclass of: W2f3zFf7TqGjiIp6K4IVNQ
definition: This U.S. industry comprises establishments of legal practitioners (except offices of lawyers and attorneys, settlement offices, and title abstract offices). These establishments are primarily engaged in providing specialized legal or paralegal services.
example: Notary public services
example: Paralegal services
example: Patent agent services (i.e., patent filing and searching services)
example: Process serving services