One-Hour Photofinishing
type: Class
subclass of: JSJBUjjLRDuw3htaff lhg
definition: This U.S. industry comprises establishments known as "one-hour" photofinishing labs primarily engaged in developing film and/or making photographic slides, prints, and enlargements on a short turnaround or while-you-wait basis.