Personal Care Services
type: Class
subclass of: RB16JIJsCApBxJjhBXmpJHi
definition: This industry group comprises establishments, such as barber and beauty shops, that provide appearance care services to individual consumers.