Precision Turned Product Manufacturing
type: Class
subclass of: 79ohnDXsSaiPIFLliyjU A
definition: This U.S. industry comprises establishments known as precision turned manufacturers primarily engaged in machining precision products of all materials on a job or order basis. Generally precision turned product jobs are large volume using machines, such as automatic screw machines, rotary transfer machines, computer numerically controlled (CNC) lathes, or turning centers.