Automotive Equipment Rental and Leasing
type: Class
subclass of: RDqvWcvBcUV4cKSUqlFKc4k
definition: This industry group comprises establishments primarily engaged in renting or leasing passenger cars and trucks without drivers and utility trailers. These establishments generally operate from a retail-like facility. Some establishments offer only short-term rental, others only longer-term leases, and some provide both types of services.