All Other Wood Product Manufacturing
type: Class
subclass of: YFbAUnqXTmaP4s08d8dFfQ
definition: This industry comprises establishments primarily engaged in manufacturing wood products (except establishments operating sawmills and wood preservation facilities; and establishments manufacturing veneer, plywood, engineered wood products, millwork, wood containers, or pallets).
example: Mobile homes manufacturing
example: Panels, prefabricated wood building, manufacturing
example: Prefabricated wood buildings manufacturing
example: Sections, prefabricated wood building, manufacturing
example: Wood dowels manufacturing
example: Wood handles (e.g., broom, handtool, mop) manufacturing