Fishing
type: Class
subclass of: IxQ2IeyQTk-NBAIa2h95Cg
definition: This industry comprises establishments primarily engaged in the commercial catching or taking of finfish, shellfish, or miscellaneous marine products from a natural habitat, such as the catching of bluefish, eels, salmon, tuna, clams, crabs, lobsters, mussels, oysters, shrimp, frogs, sea urchins, and turtles.