Fuel Dealers
type: Class
subclass of: 3QMD26oxS-KqHJDr VyQnQ
definition: This industry comprises establishments primarily engaged in retailing heating oil, liquefied petroleum (LP) gas, and other fuels via direct selling (i.e., home delivery).