Boat Dealers
type: Class
subclass of: aHmszoloS-yGNU0lp8sTYg
definition: This U.S. industry comprises establishments primarily engaged in (1) retailing new and/or used boats or retailing new boats in combination with activities, such as repair services and selling replacement parts and accessories, and/or (2) retailing new and/or used outboard motors, boat trailers, marine supplies, parts, and accessories.
example: Boat dealers (e.g., power boats, rowboats, sailboats)
example: Marine supply dealers
example: Outboard motor dealers