Special Food Services
type: Class
subclass of: R8RJIpODageO9V5kZNQgKns
definition: This industry group comprises establishments primarily engaged in providing food services at one or more of the following locations: (1) the customer's location; (2) a location designated by the customer; or (3) from motorized vehicles or nonmotorized carts.