Soft Drink and Ice Manufacturing
type: Class
subclass of: OJe1W2MTTxy1KIsdTSzAOg
definition: This industry comprises establishments primarily engaged in one or more of the following: (1) manufacturing soft drinks; (2) manufacturing ice; and (3) purifying and bottling water.