Semiconductor and Other Electronic Component Manufacturing
type: Class
subclass of: l9nbi6AFRMa3qMzPJCc mQ
definition: This industry comprises establishments primarily engaged in manufacturing semiconductors and other components for electronic applications. Examples of products made by these establishments are capacitors, resistors, microprocessors, bare and loaded printed circuit boards, electron tubes, electronic connectors, and computer modems.