Office Furniture (except Wood) Manufacturing
type: Class
subclass of: iCBE0YiVTYmtAjluJBMIUQ
definition: This U.S. industry comprises establishments primarily engaged in manufacturing nonwood office-type furniture. The furniture may be made on a stock or custom basis and may be assembled or unassembled (i.e., knockdown).