Wood Preservation
type: Class
subclass of: BPceootDSmSNz2Nt6FtVuA
definition: This U.S. industry comprises establishments primarily engaged in (1) treating wood sawed, planed, or shaped in other establishments with creosote or other preservatives, such as alkaline copper quat, copper azole, and sodium borates, to prevent decay and to protect against fire and insects and/or (2) sawing round wood poles, pilings, and posts and treating them with preservatives.