Industrial Machinery and Equipment Merchant Wholesalers
type: Class
subclass of: aEzLcZrQku0zC2h9UQLOw
definition: This industry comprises establishments primarily engaged in the merchant wholesale distribution of specialized machinery, equipment, and related parts generally used in manufacturing, oil well, and warehousing activities.
example: Fluid power transmission equipment merchant wholesalers
example: Food processing machinery and equipment merchant wholesalers
example: Material handling machinery and equipment merchant wholesalers
example: Metalworking machinery and equipment merchant wholesalers
example: Oil well machinery and equipment merchant wholesalers