Soil Preparation, Planting, and Cultivating
type: Class
subclass of: a-WMSGfvSDCXHFqyHRYryg
definition: This U.S. industry comprises establishments primarily engaged in performing a soil preparation activity or crop production service, such as plowing, fertilizing, seed bed preparation, planting, cultivating, and crop protecting services.