Plate Work Manufacturing
type: Class
subclass of: 7U3JuEuQSUKSshTwup0k2A
definition: This U.S. industry comprises establishments primarily engaged in manufacturing fabricated metal plate work by cutting, punching, bending, shaping, and welding purchased metal plate.