Horses and Other Equine Production
type: Class
subclass of: sdtUDJUnSnaex6TM9E5nYg
definition: This industry comprises establishments primarily engaged in raising horses, mules, donkeys, and other equines.