Plastics Materials and Basic Forms and Shapes Merchant Wholesalers
type: Class
subclass of: dBznQuc4TF2u9qYTVToxXA
definition: This industry comprises establishments primarily engaged in the merchant wholesale distribution of plastics materials and resins, and unsupported plastics film, sheet, sheeting, rod, tube, and other basic forms and shapes.