Frozen Fruit, Juice, and Vegetable Manufacturing
type: Class
subclass of: JR-Scke0SMqJhTkv2 TqSQ
definition: This U.S. industry comprises establishments primarily engaged in manufacturing frozen fruits; frozen vegetables; and frozen fruit juices, ades, drinks, cocktail mixes and concentrates.