Other Personal and Household Goods Repair and Maintenance
type: Class
subclass of: A35ng-FGRcus0Cc0pYFhYA
definition: This industry comprises establishments primarily engaged in repairing and servicing personal or household-type goods without retailing new personal or household-type goods (except home and garden equipment, appliances, furniture, and footwear and leather goods). Establishments in this industry repair items, such as garments; watches; jewelry; musical instruments; bicycles and motorcycles; and motorboats, canoes, sailboats, and other recreational boats.