Specialty Food Retailers
type: Class
subclass of: RCJC86Ng8OLL0uVSv8HxhwB
definition: This industry group comprises establishments primarily engaged in retailing specialized lines of food not for immediate consumption.