Veterinary Services
type: Class
subclass of: xiRvMBuZQ2Wqd5-r2rGPUw
definition: This industry comprises establishments of licensed veterinary practitioners primarily engaged in the practice of veterinary medicine, dentistry, or surgery for animals; and establishments primarily engaged in providing testing services for licensed veterinary practitioners.
example: Animal hospitals
example: Veterinarians' offices
example: Veterinary clinics
example: Veterinary testing laboratories