Waste Collection
type: Class
subclass of: eVrt8dcxTNK-CdPgDPqZUg
definition: This industry comprises establishments primarily engaged in (1) collecting and/or hauling hazardous waste, nonhazardous waste, and/or recyclable materials within a local area and/or (2) operating hazardous or nonhazardous waste transfer stations. Hazardous waste collection establishments may be responsible for the identification, treatment, packaging, and labeling of waste for the purposes of transport.