All Other Miscellaneous Textile Product Mills
type: Class
subclass of: OcUXrEVMSpupUorssYoYFA
definition: This U.S. industry comprises establishments primarily engaged in manufacturing textile products (except carpets and rugs; curtains and linens; textile bags and canvas products; rope, cordage, and twine; and tire cords and tire fabrics) from purchased materials. These establishments may further embellish the textile products they manufacture with decorative stitching. Establishments primarily engaged in adding decorative stitching such as embroidery or other art needlework on textile products, including apparel, on a contract or fee basis for the trade, are included in this industry.
example: Batts and batting (except nonwoven fabrics) manufacturing
example: Carpet cutting and binding
example: Diapers (except disposable) made from purchased materials
example: Dust cloths made from purchased fabric
example: Embroidering on textile products or apparel for the trade
example: Fishing nets made from purchased materials
example: Sleeping bags manufacturing
example: Textile fire hoses made from purchased materials
example: Weatherstripping made from purchased textiles