Computer Storage Device Manufacturing
type: Class
subclass of: Wnb0B4vNR66 Oszwz0yiSQ
definition: This U.S. industry comprises establishments primarily engaged in manufacturing computer storage devices that allow the storage and retrieval of data from a phase change, magnetic, optical, or magnetic/optical media. Examples of products made by these establishments are computer disk drives, USB flash drives, and tape storage and backup units.