Manufactured Home (Mobile Home) Manufacturing
type: Class
subclass of: fOPbREAsSIarGeJiYAaoiw
definition: This U.S. industry comprises establishments primarily engaged in making manufactured homes (i.e., mobile homes) and nonresidential mobile buildings. Manufactured homes are designed to accept permanent water, sewer, and utility connections and although equipped with wheels, they are not intended for regular highway movement.