Household and Institutional Furniture Manufacturing
type: Class
subclass of: -Cm9mv-7RueAjbhc-pGpkA
definition: This industry comprises establishments primarily engaged in manufacturing household-type and public building furniture (e.g., library, school, theater, and church furniture). This industry includes establishments that manufacture general purpose hospital, laboratory, and/or dental furniture (e.g., stools, tables, benches). The furniture may be made on a stock or custom basis and may be assembled or unassembled (i.e., knockdown).