Other Marine Fishing
type: Class
subclass of: feRSrU7jSMuNLYyfCK3qcg
definition: This U.S. industry comprises establishments primarily engaged in the commercial catching or taking of marine animals (except finfish and shellfish).