Automatic Environmental Control Manufacturing for Residential, Commercial, and Appliance Use
type: Class
subclass of: NwpC-AVOSrGS91q0HJPhaw
definition: This U.S. industry comprises establishments primarily engaged in manufacturing automatic controls and regulators for applications, such as heating, air-conditioning, refrigeration, and appliances.