Home Health Care Services
type: Class
subclass of: kGtkq19FQUKHxUs5jHd0wQ
definition: This industry comprises establishments primarily engaged in providing skilled nursing services in the home, along with a range of the following: personal care services; homemaker and companion services; physical therapy; medical social services; medications; medical equipment and supplies; counseling; 24-hour home care; occupation and vocational therapy; dietary and nutritional services; speech therapy; audiology; and high-tech care, such as intravenous therapy.
example: Home health care agencies
example: Home infusion therapy services
example: In-home hospice care services
example: Visiting nurse associations