Home Centers
type: Class
subclass of: 4H0Zw0 FRVCUCbfjpUyMJQ
definition: This industry comprises establishments generally known as home centers primarily engaged in retailing a general line of new home repair and improvement materials and supplies, such as lumber, plumbing goods, electrical goods, tools, housewares, hardware, and lawn and garden supplies, with no one merchandise line predominating.