All Other Crop Farming
type: Class
subclass of: JrfA4DJKRASmHMIr5oboeg
definition: This industry comprises establishments primarily engaged in (1) growing crops (except oilseeds and/or grains; vegetables and/or melons; fruits and/or tree nuts; greenhouse, nursery, and/or floriculture products; tobacco; cotton; sugarcane; or hay) or (2) growing a combination of crops (except a combination of oilseed(s) and grain(s); and a combination of fruit(s) and tree nut(s)) with no one crop or family of crops accounting for one-half of the establishment's agricultural production (i.e., value of crops for market).
example: Agave farming
example: General combination crop farming (except oilseed and grain; vegetables and melons; fruit and nut combinations)
example: Grass seed farming
example: Hay seed farming
example: Maple sap gathering
example: Peanut farming
example: Spice farming
example: Sugar beet farming
example: Tea farming