Fire Protection
type: Class
subclass of: tYZ2cK7VQ2Sfwks8g-xQ4w
definition: This industry comprises government establishments primarily engaged in firefighting and other related fire protection activities. Government establishments providing combined fire protection and ambulance or rescue services are classified in this industry.