All Other Miscellaneous Chemical Product and Preparation Manufacturing
type: Class
subclass of: kyN-KUDNTweyrC4jbi9QXw
definition: This U.S. industry comprises establishments primarily engaged in manufacturing chemical products (except basic chemicals, resins, and synthetic rubber; cellulosic and noncellulosic fibers and filaments; pesticides, fertilizers, and other agricultural chemicals; pharmaceuticals and medicines; paints, coatings and adhesives; soaps, cleaning compounds, and toilet preparations; printing inks; explosives; custom compounding of purchased resins; and photographic films, papers, plates, chemicals, and copy toners).
example: Activated carbon and charcoal manufacturing
example: Antifreeze preparations manufacturing
example: Electronic cigarette vapor liquids, including closed refills, manufacturing
example: Industrial salt manufacturing
example: Lighter fluids (e.g., charcoal, cigarette) manufacturing
example: Matches and matchbook manufacturing
example: Pyrotechnics (e.g., flares, flashlight bombs, signals) manufacturing
example: Sugar substitutes (i.e., synthetic sweeteners blended with other ingredients) made from purchased synthetic sweeteners
example: Swimming pool chemical preparations manufacturing
example: Writing inks manufacturing