Berry (except Strawberry) Farming
type: Class
subclass of: SMxNxWmNRdaY3reO9Yl 2A
definition: This U.S. industry comprises establishments primarily engaged in growing berries.
example: Berry (except strawberries) farming
example: Blackberry farming
example: Blueberry farming
example: Cranberry farming
example: Currant farming
example: Raspberry farming