Iron and Steel Forging
type: Class
subclass of: fD3HEmIjTCWjYGdG9M1m2g
definition: This U.S. industry comprises establishments primarily engaged in manufacturing iron and steel forgings from purchased iron and steel by hammering mill shapes. Establishments making iron and steel forgings and further manufacturing (e.g., machining, assembling) a specific manufactured product are classified in the industry of the finished product. Iron and steel forging establishments may perform surface finishing operations, such as cleaning and deburring, on the forgings they manufacture.